Gruppo,Cognome,Nome,Email,Telefono,Data di Nascita,Luogo di Nascita,Contatto 1,Email 1,Telefono 1,Contatto 2,Email 2,Telefono 2,Codice Fiscale,Data Scadenza Codice Fiscale,Data Scadenza Visita,Data Scadenza Antitetanica,Tipo Documento Identita,Numero Documento Identita,Data Scadenza Documento Identita,Numero Tessera,Data Scadenza Tessera,Iscrizione Annuale,Data Scadenza Iscrizione Annuale,Indirizzo,Grado
Scaligera Kendo,Bertaiola,MATTEO,matteo.bertaiola.2003@gmail.com,+39 342 093 3169,,BUSSOLENGO,,,,,,,BRTMTT03A24B296S,,24/03/2023,,,,,6,30/09/2023,S,30/09/2023,,1 Dan
Scaligera Kendo,CAGLIARI,GUGLIELMO,claudia.vr69@virgilio.it ,+39 347 856 7981  ,,VERONA,,,,,,,CGLGLL63H06L781S,,17/02/2022,,,,,7,30/09/2023,S,30/09/2023,,3 Dan
Scaligera Kendo,DE FRANCISCI,MARIO,igiardinidimario@yahoo.com,+39 347 454 9678,,VERONA,,,,,,,DFRMRA70D05L781J,,29/09/2022,,,,,8,30/09/2023,S,30/09/2023,,Mudan
Scaligera Kendo,FAINELLI,ANDREA,andrea.fainelli@live.it,+39 340 076 4449 ,,VERONA,,,,,,,FNLNDR99H22L781B,,10/11/2022,,,,,9,30/09/2023,S,30/09/2023,,2 Dan
Scaligera Kendo,FRANCESCHI,VALERIA,valeria.franceschi86@gmail.com,+39 340 597 4877,,BUSSOLENGO,,,,,,,FRNVLR86A53B296E,,25/08/2022,,,,,10,30/09/2023,S,30/09/2023,,1 Dan
Scaligera Kendo,GELIO,GIOVANNI,giovanni.lucifugo@gmail.com,+39 340 607 8166 ,,VERONA,,,,,,,GLEGNN78L20L781M,,15/05/2023,,,,,11,30/09/2023,S,30/09/2023,,2 Dan
Scaligera Kendo,LEARDINI,NICOLE,,,,SAN BONIFACIO,,,,,,,LRDNCL07E62H783U,,29/09/2022,,,,,12,30/09/2023,S,30/09/2023,,Mudan
Scaligera Kendo,LEARDINI,ZENO,leardini.zeno75@gmail.com,+393277399948,,TREGNAGO,,,,,,,LRDZNE75H05L364G,,29/09/2022,,,,,13,30/09/2023,S,30/09/2023,,Mudan
Scaligera Kendo,LONARDONI,EMMA,,+39 392 260 7880,,VERONA,,,,,,,LNRMME03S20L781K,,18/03/2023,,,,,14,30/09/2023,S,30/09/2023,,1 Dan
Scaligera Kendo,MARANELLI,EDOARDO,,+39 349 368 8353,,VERONA,,,,,,,MRNDRD83D01L781E,,12/04/2023,,,,,15,30/09/2023,S,30/09/2023,,Mudan
Scaligera Kendo,MERUZZI ,STEFANO,stefanomeruzzi@gmail.com,+393470179320,,VERONA,,,,,,,MRZSFN84D19L781I,,24/11/2022,,,,,16,30/09/2023,S,30/09/2023,,2 Dan
Scaligera Kendo,NOVELLI,IGOR,igor9lli@hotmail.com,+393289125952,,VERONA,,,,,,,NVLGRI75R26L781U,,03/12/2022,,,,,17,30/09/2023,S,30/09/2023,,5 Dan
Scaligera Kendo,PADOVANI,MATTIA,michela.ciurletti@gmail.com,+39 331 429 3294,,VERONA,,,,,,,PDVMTT07A17L781U,,01/03/2023,,,,,18,30/09/2023,S,30/09/2023,,1 Kyu
Scaligera Kendo,PAGAN DE PAGANIS,TOMMASO,,+39 340 626 6235,,VERONA,,,,,,,PGNTMS94L14L781D,,10/02/2023,,,,,19,30/09/2023,S,30/09/2023,,Mudan
Scaligera Kendo,PERRI,GIORGIO,giorgio.perri_1973@libero.it,+39 348 476 2223 ,,VERONA,,,,,,,PRRFRC73D14L781M,,19/09/2022,,,,,20,30/09/2023,S,30/09/2023,,3 Dan
Scaligera Kendo,PICCOLI ,ALBERTO,albepiccoli@gmail.com,+39 348 923 1382,,VERONA,,,,,,,PCCLRT80D29L781D,,11/10/2022,,,,,21,30/09/2023,S,30/09/2023,,4 Dan
Scaligera Kendo,VENTURI,ENRICO,enrico.venturi@yahoo.com,+39 347 581 7451,,VERONA,,,,,,,VNTNRC83R10L781Y,,29/03/2023,,,,,22,30/09/2023,S,30/09/2023,,1 Dan
