Column1,Column2,Column3,Column4,Column5,Column6,Column7,Column8,Column9,Column10,Column11,Column12,Column13,Column14,Column15,Column16,Column17,Column18,Column19,Column20,Column21,Column22,Column23,Column24,Column25,Column26
Gruppo,Cognome,Nome,Email,Telefono,Data di Nascita,Luogo di Nascita,Contatto 1,Email 1,Telefono 1,Contatto 2,Email 2,Telefono 2,Codice Fiscale,Data Scadenza Codice Fiscale,Data Scadenza Visita,Data Scadenza Antitetanica,Tipo Documento Identita,Numero Documento Identita,Data Scadenza Documento Identita,Numero Tessera,Data Scadenza Tessera,Iscrizione Annuale,Data Scadenza Iscrizione Annuale,Indirizzo,
,Bazzani,Lorenzo,,393892673325,19990402,Brescia,,,,,,,BZZLNZ99D02B157N,,20240212,,,,,AT-02505717,,20230912,20240912,Via Valbella 24 25065 Lumezzane (BS),
,Cavagna,Manuel,,393662744856,19971109,Brescia,,,,,,,CVGMNL97S09B157M,,,,,,,AT-02505229,,20230911,20240911,Via San Filippo Neri 45 25065 Lumezzane (BS),
,Cocca,Andrea,,393355248087,19790812,Brescia,,,,,,,CCCNRP79M12B157R,,,,,,,AT-02505230,,20230911,20240911,Via Cesare Scaluggia 44 25069 Villa Carcina (BS),
,Cornacchiari,Filippo,,393347561409,19971228,Gavardo,,,,,,,CRNFPP97T28D940B,,,,,,,AT-02505231,,20230911,20240911,Via Strada Piana 24 25071 Agnosine (BS),
,Donati,Alessio,,393386591854,19930411,Gardone Val Trompia,,,,,,,DNTLSS93D11D918V,,20241006,,,,,AT-02505378,,20230911,20240911,Via XXV Aprile 21 25065 Lumezzane (BS),
,Ghidini,Giacomo,ghidini.giacomo33@gmail.com,393387046184,19940405,Brescia,,,,,,,GHDGCM94D05B157Q,,20240221,,,,,AT-02505237,,20230911,20240911,Via Repubblica 12 25065 Lumezzane (BS),
,Ghidini,Riccardo,,393341615087,19970817,Brescia,,,,,,,GHDRCR97M17B157Z,,,,,,,AT-02505238,,20230911,20240911,Via Sant'Andrea 98 25065 Lumezzane (BS),
,Graziotti,Giulio,g.grazio@libero.it,393331561532,19931027,Brescia,,,,,,,GRZGLI93R27B157R,,,,,,,AT-02528398,,20231216,20241216,Via Caselli 42 25065 Lumezzane (BS),
,Guagnetti,Daniel,,393314464492,20040130,Gardone Val Trompia,,,,,,,GGNDNL04A30D918Z,,,,,,,AT-02505721,,20230912,20240912,Via Renzo 10 25065 Lumezzane (BS),
,Lena,Nicola,,393891449783,19920612,Brescia,,,,,,,LNENCL92H12B157U,,20240216,,,,,AT-02505239,,20230911,20240911,Via Padre Bolognini 52 25065 Lumezzane (BS),
,Mori,Paolo,mori92lume@hotmail.com,393339227260,19920206,Gardone Val Trompia,,,,,,,MROPLA92B06D918R,,,,,,,AT-02505241,,20230911,20240911,Via D. Alighieri 28 25065 Lumezzane (BS),
,Potenza,Luigi,luigi.potenza@icloud.com,393205529590,19920223,Gardone Val Trompia,,,,,,,PTNLGU92B23D918I,,,,,,,AT-02505243,,20230911,20240911,Via V. Montini 178 25065 Lumezzane (BS),
,Primerano,Simone,,393804940271,19980609,Brescia,,,,,,,PRMSMN98H09B157V,,,,,,,AT-02504162,,20230907,20240907,Via M. Zanagnolo 25/S 25065 Lumezzane (BS),
,Raza,Marco,razamarco6@gmail.com,393286844822,19930810,Gardone Val Trompia,,,,,,,RZAMCF93M10D918O,,,,,,,AT-02505244,,20230911,20240911,Vicolo Fratte 5 25064 Gussago (BS),
,Sabiu,Stefano,,393313154966,19990331,Gardone Val Trompia,,,,,,,SBASFN99C31D918K,,,,,,,AT-02505722,,20230912,20240912,Via Maestro Zanagnolo 23 Z 25065 Lumezzane (BS),
,Sanzogni,Carlo,sanzo.94@hotmail.com,393883214271,19940408,Brescia,,,,,,,SNZCRL94D08B157N,,,,,,,AT-02505247,,20230911,20240911,Via S. G. Battista 75 25065 Lumezzane (BS),
,Tampalini,Pierangelo,,393341118733,19920617,Brescia,,,,,,,TMPPNG92H17B157V,,,,,,,AT-02505248,,20230911,20240911,Via Caselli 75 25065 Lumezzane (BS),
,Vivenzi,Alberto,albo.vivenzi@hotmail.com,393336993319,19920803,Brescia,,,,,,,VVNLRT92M03B157E,,,,,,,AT-02505251,,20230911,20240911,Via G. Matteotti 67 25065 Lumezzane (BS),
,Zanetti,Riccardo,riccardozanetti22@gmail.com,393334076239,19920624,Gardone Val Trompia,,,,,,,ZNTRCR92H24D918C,,,,,,,AT-02505255,,20230911,20240911,Via Zanagnolo 2 25065 Lumezzane (BS),
