Gruppo,Cognome,Nome,Email,Telefono,Data di Nascita,Luogo di Nascita,Contatto 1,Email 1,Telefono 1,Contatto 2,Email 2,Telefono 2,Codice Fiscale,Data Scadenza Codice Fiscale,Data Scadenza Visita,Data Scadenza Antitetanica,Tipo Documento Identita,Numero Documento Identita,Data Scadenza Documento Identita,Numero Tessera,Data Scadenza Tessera,Iscrizione Annuale,Data Scadenza Iscrizione Annuale,Indirizzo,Categoria,Classe
,ROSSI,ENRICO,eross60@libero.it,339 5749687,27/11/1960,LIBIA,,,,,,,RSSNRC60S27Z326A,,17/10/2018,,,,,,,S,31/08/2018,,,
,LEONI,PAOLO,whitearrow@libero.it,,10/02/1959,ROMA,,,,,,,LNEPLA59B10H501L,,01/07/2017,,,,,,,,,,,
,MENICHELLI,FURIO,furiomen@libero.it,329 4591075,10/02/1964,ROMA,,,,,,,MNCFRU64B10H501G,,11/04/2018,,,,,,,,,,,
,MURGIA,LUCA,luca.murgia@email.it,3483308431,25/09/1962,NETTUNO RM,,,,,,,MRGLCU62P25F880Y,,17/10/2018,,,,,,,,,,,
,PALOMBA,IRRIDIO,irridio@hotmail.com,347 4604387,17/05/1965,ANZIO RM,,,,,,,PLMRRD65E17A323T,,28/09/2016,,,,,,,,,,,
,GUARINO,MARCO,bobbo81@hotmail.it,333 1875501,30/03/1981,ROMA,,,,,,,GRNMRC81C30H501T,,01/11/2017,,,,,,,,,,,
,MANGANELLI,MARCO,manganelli.marco@libero.it,06 9873299,11/11/1956,ALASSIO SV,,,,,,,MNGMRC56S11A122D,,20/09/2019,,,,,,,,,,,
,TESTA,GIANLUCA,gianluca.testa84@libero.it,333 2415148,02/04/1984,APRILIA LT,,,,,,,TSTGLC84D02A341A,,05/04/2019,,,,,,,,,,,
,ALLERUZZO,TOMMASO,simonacavallito@gmail.com,,13/06/2007,ROMA,,,,,,,LLRTMS07H13D972R,,24/10/2018,,,,,,,,,,,
,SAJEVA,STEFANO,sajeva.stefano@libero.it,3347695592,20/01/1996,TIVOLI,,,,,,,SJVSFN96A20L182A,,30/03/2019,,,,,,,,,,,
,MARZOLINI,ATTILIO,marzat@libero.it,3497747558,11/06/1951,ROMA,,,,,,,MRZTTL51H11H501Y,,05/02/2019,,,,,,,,,,,
,TERMINE,SOFIA,diegotermine@gmail.com,,08/07/2005,ROMA,,,,,,,TRMSFO05L48H501R,,10/11/2018,,,,,,,,,,,
,FOLCO,ALESSANDRO,folco1959@gmail.com,3332209455,22/10/1998,ANZIO,,,,,,,FLCLSN98R22A323V,,10/10/2019,,,,,,,,,,,
,D'ASCANIO,MATTEO,dascanio.a71@gmail.com,3478769511,21/12/2004,ANZIO RM,,,,,,,DSCMTT04T21A323I,,05/10/2018,,,,,,,,,,,
,TERMINE,DIEGO,diegotermine@gmail.com,3455544802,03/04/1968,ROMA,,,,,,,TRMDGI68D03H501C,,12/08/2019,,,,,,,,,,,
,BORTOLAMI,MIRKO,mirkobortolami@gmail.com,,15/08/2004,ANZIO,,,,,,,BRTMRK04M15A323K,,09/02/2019,,,,,,,,,,,
,BORTOLAMI,CLAUDIO,clabortolami@gmail.com,3394775669,23/05/1970,ANZIO,,,,,,,BRTCLD70E23A323N,,09/02/2019,,,,,,,,,,,
,FINOCCHIO,BARBARA,clabortolami@gmail.com,3394775669,16/05/1972,NETTUNO,,,,,,,FNCBBR72E56F880A,,10/10/2019,,,,,,,,,,,
,BORTOLAMI,MANUEL,clabortolami@gmail.com,3394775669,22/04/2009,ANZIO,,,,,,,BRTMNL09D22A323K,,10/10/2019,,,,,,,,,,,
,MURGIA,LUCA,personale@murgialuca.it,,25/09/2009,ANZIO,,,,,,,MRGLCU09P25A323A,,17/10/2018,,,,,,,,,,,
,CIRIGLIANO,RICCARDO,franco.rda@hotmail.it,3663193735,19/06/1999,CATANIA,,,,,,,CRGRCR99H19C354D,,30/10/2018,,,,,,,,,,,
,TORELLI,MATTIA,,,26/10/1991,ANZIO,,,,,,,TRLMTT91R26A323N,,27/10/2018,,,,,,,,,,,
,GUGLIELMELLI,ERMINIO,,3313722001,03/03/1964,ROMA,,,,,,,GGLRMN64C03H501U,,21/10/2018,,,,,,,,,,,
,GUGLIELMELLI,LUCIANO,,3468540513,23/12/1960,ROMA,,,,,,,GGLLCN60T23H501I,,21/10/2018,,,,,,,,,,,
,GEREMIA,MARCO,sico79@alice.it,3420762466,28/02/1988,ROMA,,,,,,,GRMMRC88B28H501K,,01/12/2018,,,,,,,,,,,
,GEREMIA,DANIELE,daniele.geremia89@gmail.com,3473687924,16/11/1989,ROMA,,,,,,,GRMDNL89S16H501E,,20/12/2018,,,,,,,,,,,
,LORENZINI,LEONARDO,,,24/10/1977,CIVITAVECCHIA,,,,,,,LRNLRD77R24C773J,,24/02/2018,,,,,,,,,,,
,CONTU,MARTA,carlaldp74@gmail.com,3334501546,13/11/2004,ROMA,,,,,,,CNTMRT04S63H501Q,,18/02/2019,,,,,,,,,,,
,VALLEROTONDA,GIULIA,vallerotondag@gmail.com,3201558887,28/06/2004,ANZIO,,,,,,,VLLGLI04H68A323C,,15/02/2019,,,,,,,,,,,
,D'ASCANIO,ALESSANDRO,dascanio.a71@gmail.com,3478769511,13/12/1971,ANZIO,,,,,,,DSCLSN71T13A323S,,20/03/2019,,,,,,,,,,,
,TERMINE,SABRINA,diegotermine@gmail.com,3455544802,10/07/2010,ROMA,,,,,,,TRMSRN10L50H501O,,12/08/2019,,,,,,,,,,,
,D'ASCANIO,DAMIANO,nondisponibile@gmail.com,,31/03/2009,ANZIO,,,,,,,DSCDMN09C31A323U,,02/07/2019,,,,,,,,,,,
,MARCONI,NATALIA,ric.marconi@alice.it,,15/09/2008,ROMA,,,,,,,MRCNTL08P55H501Y,,03/08/2019,,,,,,,,,,,
,LAMPIS,ALESSANDRO,lampis64@gmail.com,3936214536,06/07/1964,ROMA,,,,,,,LMPLSN64L06H501J,,20/07/2019,,,,,,,,,,,
,MARCONI,RICCARDO,,,02/10/1972,ROMA,,,,,,,MRCRCR72R02H501B,,05/09/2018,,,,,,,,,,,
,CEDENO,SILVIA,,,06/07/1976,GUAYAQUIL,,,,,,,CDNSVN76L46Z605M,,02/09/2018,,,,,,,,,,,
,VIRGILIO,FABIO,nondisponibile@gmail.com,,04/07/1987,ROMA,,,,,,,VRGFBA87L04H501C,,19/09/2019,,,,,,,,,,,
,PASSARO,ALESSANDRO,alessandropassaro01@gmail.com,3288072610,28/11/1984,ROMA,,,,,,,,,,,,,,,,,,,,
,PACCHIONI,ALDO,pacchionialdo@hotmail.com,3278555316,12/11/1950,GENOVA,,,,,,,PCCLDA50S12D969G,,,,,,,,,,,,,
,D'AMICO,VIRGINIO,virginetto@libero.it,3476698486,21/03/1965,ALATRI,,,,,,,DMCVGN65C21A123,,,,,,,,,,,,,
,BATELLA,GIOCONDO,giocondo.b@gmail.com,329079473,07/12/1951,GUBBIO,,,,,,,BTLGND51T07E256W,,,,,,,,,,,,,
,PERINI,PIERO,,,,,,,,,,,,,,,,,,,,,,,,
,,LUCIA,,,,,,,,,,,,,,,,,,,,,,,,