Gruppo,Cognome,Nome,Email,Telefono,"Data di Nascita","Luogo di Nascita","Contatto 1","Email 1","Telefono 1","Contatto 2","Email 2","Telefono 2","Codice Fiscale","Data Scadenza Codice Fiscale","Data Scadenza Visita","Data Scadenza Antitetanica","Tipo Documento Identita","Numero Documento Identita","Data Scadenza Documento Identita","Numero Tessera","Data Scadenza Tessera","Iscrizione Annuale","Data Scadenza Iscrizione Annuale",Indirizzo,"Email 2","Luogo di Nascita","Iscrizione Annuale","Data di Nascita","Contatto 2","Numero Tessera","Data Scadenza Codice Fiscale","Email 1","Telefono 1","Telefono 2","Numero Documento Identita","Data Scadenza Antitetanica","Contatto 1"
,Melis,Mirko,azeglio2006@gmail.com,3351863466,00/00/0000,,,,,,,,,,,,,,,,,N,,,,,,,,,,,,,,
,Berrighi,Ludovico,azeglio2006@gmail.com,,00/00/0000,,,,,,,,,,,,C.I.,,,,,N,,,,Ivrea,S,20/04/2006,,2993455,,,,,AY2239697,,
,Brusoni,Alessandro,azeglio2006@gmail.com,,00/00/0000,,,,,,,,,,20/3//10/0,,,,,,,N,,,,Torino,S,01/01/2006,,7026144,,,,,,,
,Castiglioni,Luca,azeglio2006@gmail.com,,00/00/0000,,,,,,,,,,20/8//01/0,,C.I.,,,,,N,,,,Borgomanero,S,17/06/2006,,2739623,,,,,AX2069828,,
,Coda,Mattia,azeglio2006@gmail.com,,00/00/0000,,,,,,,,,,20/7//01/0,,C.I.,,,,,N,,,,Cirie',S,01/10/2006,,2233264,,,,,AX3333936,,
,Colombo,Fabio,azeglio2006@gmail.com,,00/00/0000,,,,,,,,,,20/2//21/0,,C.I.,,,,,N,,,,Torino,S,23/01/2006,,2127642,,,,,AX5910298,,
,D'Onofrio,Massimo,azeglio2006@gmail.com,,00/00/0000,,,,,,,,,,20/9//27/0,,C.I.,,,,,N,,,,Ivrea,S,21/09/2006,,2233257,,,,,AT6978492,,
,"De Manincor",Leone,azeglio2006@gmail.com,,00/00/0000,,,,,,,,,,19/1//01/0,,,,,,,N,,,,Cuorgne',S,06/05/2006,,2516092,,,,,,,
,Ferri,Alessandro,azeglio2006@gmail.com,,00/00/0000,,,,,,,,,,20/8//22/0,,C.I.,,,,,N,,,,Ivrea,S,10/04/2006,,2718474,,,,,AV9681893,,
,Gazzola,Marco,azeglio2006@gmail.com,,00/00/0000,,,,,,,,,,20/3//11/0,,,,,,,N,,,,Ivrea,S,15/01/2006,,2516198,,,,,,,
,Gianola,Edoardo,azeglio2006@gmail.com,,00/00/0000,,,,,,,,,,20/8//31/0,,C.I.,,,,,N,,,,Torino,S,18/06/2006,,7076488,,,,,AY2239731,,
,Guerrini,Nicolo',azeglio2006@gmail.com,,00/00/0000,,,,,,,,,,20/3//01/0,,C.I.,,,,,N,,,,Biella,S,08/03/2006,,2528989,,,,,CA31293DW,,
,Iamonte,Fabio,azeglio2006@gmail.com,,00/00/0000,,,,,,,,,,20/0//04/1,,C.I.,,,,,N,,,,Ivrea,S,30/10/2006,,2233259,,,,,AV9673961,,
,Imanon,Alessio,azeglio2006@gmail.com,,00/00/0000,,,,,,,,,,20/8//25/0,,C.I.,,,,,N,,,,Ivrea,S,21/03/2006,,2340226,,,,,AX7764038,,
,Melis,Julian,azeglio2006@gmail.com,,00/00/0000,,,,,,,,,,20/1//04/1,,C.I.,,,,,N,,,,Torino,S,01/11/2006,,2076011,,,,,CA46804CU,,
,Romano,Diego,azeglio2006@gmail.com,,00/00/0000,,,,,,,,,,20/0//04/1,,C.I.,,,,,N,,,,Ivrea,S,28/09/2006,,2233270,,,,,AY2180659,,
,Romano,Simone,azeglio2006@gmail.com,,00/00/0000,,,,,,,,,,19/1//01/0,,C.I.,,,,,N,,,,Ivrea,S,18/02/2006,,2516388,,,,,CA3666CC,,
,Ronco,Christian,azeglio2006@gmail.com,,00/00/0000,,,,,,,,,,20/1//15/1,,,,,,,N,,,,Moncalieri,S,23/09/2006,,2472446,,,,,,,
,Tricerri,Alessandro,azeglio2006@gmail.com,,00/00/0000,,,,,,,,,,20/9//11/0,,,,,,,N,,,,Torino,S,20/05/2006,,2423108,,,,,,,
,Viotto,Edoardo,azeglio2006@gmail.com,,00/00/0000,,,,,,,,,,19/1//01/0,,C.I.,,,,,N,,,,Ivrea,S,17/09/2006,,2525970,,,,,AX2846985,,
,Vola,Simone,azeglio2006@gmail.com,,00/00/0000,,,,,,,,,,19/1//01/0,,C.I.,,,,,N,,,,Ivrea,S,30/05/2006,,2414551,,,,,CA92690BO,,
